Problem in executing test files of RPU

Tagged: , , ,

This topic contains 0 replies, has 1 voice, and was last updated by  tide 2 years ago.

Viewing 1 post (of 1 total)
  • Author
    Posts
  • #51146

    tide
    Member

    Hi, I am trying to run a test case of RPU. I am following the procedure given in LTE.Release Notes.1.0.5.External.pdf document. The programs are compiled correctly but it gives error during linking process. It looks like there is some error in setting up the environment variables, but I am not able to resolve this issue. Any help is highly appreciated. Here is the output of the code:
    tide@tide-VirtualBox:~/Documents/LTE/ip/software/phy/test/loader/build/smake$ smake CONFIG=test TARGET=CORE UCCP=450_43 TEST_NAME=CellSearch SUBTESTS=TEST_ALL all
    INFO: Environment or command line variables changed, clobbering…
    Clobbering…
    =============================================================================
    smake 7.9.37 | Wed Oct 7 10:16:31 2015

    Building : mcpTestHarness
    Goals : clobber all [parallel x1]

    TARGET = CORE
    UCCP = 450_43
    CONFIG = test

    UCC_INST_ROOT = /opt/imgtec/ucc/5.9.0
    MIPS_ELF_ROOT = /opt/imgtec/Toolchains/mips-mti-elf/2015.01-7
    =============================================================================
    Publishing MOD::mock_ecurt::mcpCoproDefs.h
    Publishing MOD::mock_ecurt::mock_ecurt.h
    Publishing MOD::uccrt::uccLow.h
    Publishing MOD::uccrt::uccLowPrim.h
    Publishing MOD::uccrt::uccPdump.h
    …….
    …… I removed few lines here
    ……
    …….
    Publishing INTERFACE::turboDecoder::turboDecoder.h
    Publishing INTERFACE::turboDecoderConfig::turboDecoderConfig.h
    Assembling MCP image mcpprogs …
    mcpal Warning: /home/kuldeep/Documents/LTE/ip/software/phy/mods/CPsearch/source/mcp/CPsearch.mcp: 388: Accumulate latency not fenced by return.
    Assembling MOD::irqGenDefaultDriver::irqGenDefaultDriver.dcps …
    Publishing MOD::irqGenDefaultDriver::irqGenDefaultDriver_DCP.h
    Publishing MOD::irqGenDefaultDriver::irqGenDefaultDriver.dcp.xml
    Creating DCP library libirqGenDefaultDriver_test.dcplib …
    Making DCP image for APP::mcpTestApp
    Generating register formatter image for APP::mcpTestApp …
    Formatting MCP image family mcpprogs …
    Compiling APP::mcpTestApp::mcpprogs.c …
    Compiling APP::mcpTestApp::mcpprogs_family_data.c …
    …..
    …… I removed few lines here
    ……
    …..
    Compiling MOD::uccrt::ucc.c …
    Compiling MOD::uccrt::virtualregister.c …
    Compiling MOD::mock_ecurt::mock_ecurt.c …
    Making library libmock_ecurt_test_MIPSGCC.a…
    Making library libuccrt_uccp450_43_NA_test_MIPSGCC.a…
    Making library libirqGenDefaultDriver_test_MIPSGCC.a…
    Making library libtestSupport_test_MIPSGCC.a…
    Making library libfileio_test_MIPSGCC.a…
    Making library libdriverSupport_test_MIPSGCC.a…
    Making library liblteModem_test_MIPSGCC.a…
    Making library liblteLogging_test_MIPSGCC.a…
    Making library libCellSearch_test_MIPSGCC.a…
    Making library libPSSsearch_test_MIPSGCC.a…
    Making library libPSSChannelEst_test_MIPSGCC.a…
    Making library libSSSdetect_test_MIPSGCC.a…
    Making library libCPsearch_test_MIPSGCC.a…
    Making library libextractSubcarriers_test_MIPSGCC.a…
    Making library libfracCFO_test_MIPSGCC.a…
    Making library libfracCFOest_test_MIPSGCC.a…
    Making library libfracCFOphasor_test_MIPSGCC.a…
    Making library libangle_phasorToFracRot_test_MIPSGCC.a…
    Making library libfracCFOcompensation_test_MIPSGCC.a…
    Making library libffteDriver_test_MIPSGCC.a…
    Making library libgenPSS_test_MIPSGCC.a…
    Making library libcommon_test_MIPSGCC.a…
    Making library libfftMcp_test_MIPSGCC.a…
    Making library libmemoryManagement_test_MIPSGCC.a…
    Creating library APP::mcpTestApp.a
    Linking applications …
    /opt/imgtec/Toolchains/mips-mti-elf/2015.01-7/bin/../lib/gcc/mips-mti-elf/4.9.2/../../../../mips-mti-elf/lib/micromips/el/sof/libuhi.a(uhi_exit.o): In function `__exit’:
    /user/mipsswt/git/newlib/libgloss/mips/uhi_exit.c:(.text+0x4): undefined reference to `__use_excpt_boot’
    /user/mipsswt/git/newlib/libgloss/mips/uhi_exit.c:(.text+0xc): undefined reference to `__use_excpt_boot’
    /opt/imgtec/Toolchains/mips-mti-elf/2015.01-7/bin/../lib/gcc/mips-mti-elf/4.9.2/../../../../mips-mti-elf/lib/micromips/el/sof/libhal.a(mips_excpt_register.o): In function `.L11′:
    (.text+0x96): undefined reference to `__excpt_ebase’
    /opt/imgtec/Toolchains/mips-mti-elf/2015.01-7/bin/../lib/gcc/mips-mti-elf/4.9.2/../../../../mips-mti-elf/lib/micromips/el/sof/libhal.a(mips_excpt_register.o): In function `.L11′:
    (.text+0x9a): undefined reference to `__excpt_ebase’
    collect2: error: ld returned 1 exit status
    make[1]: *** [/home/kuldeep/Documents/LTE/ip/software/phy/test/loader/build/smake/test_MIPSGCC/mcpTestHarness.py] Error 1
    make: *** [all] Error 2
    tide@tide-VirtualBox:~/Documents/LTE/ip/software/phy/test/loader/build/smake$

    Thank you

Viewing 1 post (of 1 total)
You must be logged in to reply to this topic.